(view as text)
ctest -V
 in dir /home/libcellml/buildslave/Unit_Tests_Builder_Ubuntu_14_04_64_Bit/libcellml-build (timeout 1200 secs)
 watching logfiles {}
 argv: ['ctest', '-V']
 environment:
  HOME=/home/libcellml
  LANG=en_NZ.UTF-8
  LOGNAME=libcellml
  MAIL=/var/mail/libcellml
  PATH=/usr/local/bin:/usr/bin:/bin:/usr/local/games:/usr/games
  PWD=/home/libcellml/buildslave/Unit_Tests_Builder_Ubuntu_14_04_64_Bit/libcellml-build
  QT_QPA_PLATFORMTHEME=appmenu-qt5
  SHELL=/bin/sh
  TERM=linux
  USER=libcellml
  XDG_RUNTIME_DIR=/run/user/1005
  XDG_SESSION_ID=c3
 using PTY: False
UpdateCTestConfiguration  from :/home/libcellml/buildslave/Unit_Tests_Builder_Ubuntu_14_04_64_Bit/libcellml-build/DartConfiguration.tcl
UpdateCTestConfiguration  from :/home/libcellml/buildslave/Unit_Tests_Builder_Ubuntu_14_04_64_Bit/libcellml-build/DartConfiguration.tcl
Test project /home/libcellml/buildslave/Unit_Tests_Builder_Ubuntu_14_04_64_Bit/libcellml-build
Constructing a list of tests
Done constructing a list of tests
Checking test dependency graph...
Checking test dependency graph end
test 1
      Start  1: entities_unit_test_component

1: Test command: /home/libcellml/buildslave/Unit_Tests_Builder_Ubuntu_14_04_64_Bit/libcellml-build/tests/test_component
1: Test timeout computed to be: 9.99988e+06
1: Running main() from gtest_main.cc
1: [==========] Running 18 tests from 2 test cases.
1: [----------] Global test environment set-up.
1: [----------] 11 tests from Component
1: [ RUN      ] Component.validName
1: [       OK ] Component.validName (0 ms)
1: [ RUN      ] Component.invalidName
1: [       OK ] Component.invalidName (0 ms)
1: [ RUN      ] Component.setAndUnsetName
1: [       OK ] Component.setAndUnsetName (0 ms)
1: [ RUN      ] Component.addAndCountChildren
1: [       OK ] Component.addAndCountChildren (0 ms)
1: [ RUN      ] Component.contains
1: [       OK ] Component.contains (0 ms)
1: [ RUN      ] Component.addChildrenAndSerialise
1: [       OK ] Component.addChildrenAndSerialise (0 ms)
1: [ RUN      ] Component.removeComponentMethods
1: [       OK ] Component.removeComponentMethods (0 ms)
1: [ RUN      ] Component.getComponentMethods
1: [       OK ] Component.getComponentMethods (0 ms)
1: [ RUN      ] Component.takeComponentMethods
1: [       OK ] Component.takeComponentMethods (0 ms)
1: [ RUN      ] Component.replaceComponentMethods
1: [       OK ] Component.replaceComponentMethods (0 ms)
1: [ RUN      ] Component.constructors
1: [       OK ] Component.constructors (1 ms)
1: [----------] 11 tests from Component (1 ms total)
1: 
1: [----------] 7 tests from Encapsulation
1: [ RUN      ] Encapsulation.reparentComponent
1: [       OK ] Encapsulation.reparentComponent (0 ms)
1: [ RUN      ] Encapsulation.hierarchyWaterfall
1: [       OK ] Encapsulation.hierarchyWaterfall (0 ms)
1: [ RUN      ] Encapsulation.hierarchyCircular
1: [       OK ] Encapsulation.hierarchyCircular (0 ms)
1: [ RUN      ] Encapsulation.hierarchyWaterfallAndParse
1: [       OK ] Encapsulation.hierarchyWaterfallAndParse (1 ms)
1: [ RUN      ] Encapsulation.parseAlternateFormHierarchy
1: [       OK ] Encapsulation.parseAlternateFormHierarchy (0 ms)
1: [ RUN      ] Encapsulation.encapsulatedComponentMethods
1: [       OK ] Encapsulation.encapsulatedComponentMethods (0 ms)
1: [ RUN      ] Encapsulation.encapsulationWithMultipleRootHierarchy
1: [       OK ] Encapsulation.encapsulationWithMultipleRootHierarchy (0 ms)
1: [----------] 7 tests from Encapsulation (1 ms total)
1: 
1: [----------] Global test environment tear-down
1: [==========] 18 tests from 2 test cases ran. (3 ms total)
1: [  PASSED  ] 18 tests.
 1/35 Test  #1: entities_unit_test_component .....   Passed    0.01 sec
test 2
      Start  2: entities_unit_test_connection

2: Test command: /home/libcellml/buildslave/Unit_Tests_Builder_Ubuntu_14_04_64_Bit/libcellml-build/tests/test_connection
2: Test timeout computed to be: 9.99988e+06
2: Running main() from gtest_main.cc
2: [==========] Running 21 tests from 2 test cases.
2: [----------] Global test environment set-up.
2: [----------] 6 tests from Variable
2: [ RUN      ] Variable.addAndGetEquivalentVariable
2: [       OK ] Variable.addAndGetEquivalentVariable (0 ms)
2: [ RUN      ] Variable.addAndGetEquivalentVariableReciprocal
2: [       OK ] Variable.addAndGetEquivalentVariableReciprocal (0 ms)
2: [ RUN      ] Variable.addTwoEquivalentVariablesAndCount
2: [       OK ] Variable.addTwoEquivalentVariablesAndCount (0 ms)
2: [ RUN      ] Variable.addDuplicateEquivalentVariablesAndCount
2: [       OK ] Variable.addDuplicateEquivalentVariablesAndCount (0 ms)
2: [ RUN      ] Variable.hasNoEquivalentVariable
2: [       OK ] Variable.hasNoEquivalentVariable (0 ms)
2: [ RUN      ] Variable.hasEquivalentVariable
2: [       OK ] Variable.hasEquivalentVariable (0 ms)
2: [----------] 6 tests from Variable (1 ms total)
2: 
2: [----------] 15 tests from Connection
2: [ RUN      ] Connection.componentlessVariableInvalidConnection
2: [       OK ] Connection.componentlessVariableInvalidConnection (0 ms)
2: [ RUN      ] Connection.componentlessVariableInvalidConnectionClearParentCheck
2: [       OK ] Connection.componentlessVariableInvalidConnectionClearParentCheck (0 ms)
2: [ RUN      ] Connection.validConnectionAndParse
2: [       OK ] Connection.validConnectionAndParse (1 ms)
2: [ RUN      ] Connection.parseValidAlternateFormConnection
2: [       OK ] Connection.parseValidAlternateFormConnection (0 ms)
2: [ RUN      ] Connection.twoMapVariablesConnection
2: [       OK ] Connection.twoMapVariablesConnection (0 ms)
2: [ RUN      ] Connection.threeMapVariablesConnectionOneDuplicate
2: [       OK ] Connection.threeMapVariablesConnectionOneDuplicate (0 ms)
2: [ RUN      ] Connection.nineVariablesTenConnectionsAndParse
2: [       OK ] Connection.nineVariablesTenConnectionsAndParse (1 ms)
2: [ RUN      ] Connection.twoValidConnections
2: [       OK ] Connection.twoValidConnections (0 ms)
2: [ RUN      ] Connection.removeEquivalentVariableMethods
2: [       OK ] Connection.removeEquivalentVariableMethods (1 ms)
2: [ RUN      ] Connection.removeVariablesFromConnections
2: [       OK ] Connection.removeVariablesFromConnections (0 ms)
2: [ RUN      ] Connection.twoEncapsulatedChildComponentsWithConnectionsAndMixedInterfaces
2: [       OK ] Connection.twoEncapsulatedChildComponentsWithConnectionsAndMixedInterfaces (1 ms)
2: [ RUN      ] Connection.twoEncapsulatedChildComponentsWithConnectionsAndMixedInterfacesUsingIds
2: [       OK ] Connection.twoEncapsulatedChildComponentsWithConnectionsAndMixedInterfacesUsingIds (0 ms)
2: [ RUN      ] Connection.twoEncapsulatedChildComponentsWithConnectionsAndPublicInterfaces
2: [       OK ] Connection.twoEncapsulatedChildComponentsWithConnectionsAndPublicInterfaces (0 ms)
2: [ RUN      ] Connection.importedComponentConnectionAndParse
2: [       OK ] Connection.importedComponentConnectionAndParse (1 ms)
2: [ RUN      ] Connection.componentConnectionAndParseMissingVariable
2: [       OK ] Connection.componentConnectionAndParseMissingVariable (0 ms)
2: [----------] 15 tests from Connection (6 ms total)
2: 
2: [----------] Global test environment tear-down
2: [==========] 21 tests from 2 test cases ran. (7 ms total)
2: [  PASSED  ] 21 tests.
 2/35 Test  #2: entities_unit_test_connection ....   Passed    0.02 sec
test 3
      Start  3: misc_unit_test_coverage

3: Test command: /home/libcellml/buildslave/Unit_Tests_Builder_Ubuntu_14_04_64_Bit/libcellml-build/tests/test_coverage
3: Test timeout computed to be: 9.99988e+06
3: Running main() from gtest_main.cc
3: [==========] Running 9 tests from 1 test case.
3: [----------] Global test environment set-up.
3: [----------] 9 tests from Coverage
3: [ RUN      ] Coverage.import
3: [       OK ] Coverage.import (0 ms)
3: [ RUN      ] Coverage.printer
3: [       OK ] Coverage.printer (0 ms)
3: [ RUN      ] Coverage.units
3: [       OK ] Coverage.units (0 ms)
3: [ RUN      ] Coverage.when
3: [       OK ] Coverage.when (0 ms)
3: [ RUN      ] Coverage.unitsGetVariations
3: [       OK ] Coverage.unitsGetVariations (0 ms)
3: [ RUN      ] Coverage.prefixToString
3: [       OK ] Coverage.prefixToString (2 ms)
3: [ RUN      ] Coverage.variable
3: [       OK ] Coverage.variable (0 ms)
3: [ RUN      ] Coverage.component
3: [       OK ] Coverage.component (0 ms)
3: [ RUN      ] Coverage.error
3: [       OK ] Coverage.error (0 ms)
3: [----------] 9 tests from Coverage (2 ms total)
3: 
3: [----------] Global test environment tear-down
3: [==========] 9 tests from 1 test case ran. (3 ms total)
3: [  PASSED  ] 9 tests.
 3/35 Test  #3: misc_unit_test_coverage ..........   Passed    0.01 sec
test 4
      Start  4: object_unit_test_error

4: Test command: /home/libcellml/buildslave/Unit_Tests_Builder_Ubuntu_14_04_64_Bit/libcellml-build/tests/test_error
4: Test timeout computed to be: 9.99988e+06
4: Running main() from gtest_main.cc
4: [==========] Running 8 tests from 1 test case.
4: [----------] Global test environment set-up.
4: [----------] 8 tests from Error
4: [ RUN      ] Error.createModelError
4: [       OK ] Error.createModelError (0 ms)
4: [ RUN      ] Error.createComponemntError
4: [       OK ] Error.createComponemntError (0 ms)
4: [ RUN      ] Error.createVariableError
4: [       OK ] Error.createVariableError (0 ms)
4: [ RUN      ] Error.createUnitsError
4: [       OK ] Error.createUnitsError (0 ms)
4: [ RUN      ] Error.createImportSourceError
4: [       OK ] Error.createImportSourceError (0 ms)
4: [ RUN      ] Error.createResetError
4: [       OK ] Error.createResetError (0 ms)
4: [ RUN      ] Error.createWhenError
4: [       OK ] Error.createWhenError (0 ms)
4: [ RUN      ] Error.specificationRule
4: [       OK ] Error.specificationRule (1 ms)
4: [----------] 8 tests from Error (1 ms total)
4: 
4: [----------] Global test environment tear-down
4: [==========] 8 tests from 1 test case ran. (1 ms total)
4: [  PASSED  ] 8 tests.
 4/35 Test  #4: object_unit_test_error ...........   Passed    0.01 sec
test 5
      Start  5: io_unit_test_generator

5: Test command: /home/libcellml/buildslave/Unit_Tests_Builder_Ubuntu_14_04_64_Bit/libcellml-build/tests/test_generator
5: Test timeout computed to be: 9.99988e+06
5: Running main() from gtest_main.cc
5: [==========] Running 6 tests from 1 test case.
5: [----------] Global test environment set-up.
5: [----------] 6 tests from Generator
5: [ RUN      ] Generator.generateSimpleModel
5: /home/libcellml/buildslave/Unit_Tests_Builder_Ubuntu_14_04_64_Bit/libcellml/tests/generator/generator.cpp:90: Failure
5: Expected equality of these values:
5:   e
5:     Which is: "void initConsts(double* constants, double* rates, double* states)\n{\n    double &y = *(states + 0);\n\n\n    y = -2;\n\n}\nvoid computeRates(double voi, double* constants, double* rates, double* states, double* algebraic)\n{\n    const double t = voi;\n\n\n    double &y = *(states + 0);\n\n\n    rates[0] = (y + 4);\n\n}\nvoid computeVariables(double voi, double* constants, double* rates, double* states, double* algebraic)\n{\n}\n"
5:   a
5:     Which is: "void initConsts(double *constants, double *rates, double *states)\n{\n    double &y = *(states + 0);\n\n\n    y = -2;\n\n}\nvoid computeRates(double voi, double *constants, double *rates, double *states, double *algebraic)\n{\n    const double t = voi;\n\n\n    double &y = *(states + 0);\n\n\n    rates[0] = (y + 4);\n\n}\nvoid computeVariables(double voi, double *constants, double *rates, double *states, double *algebraic)\n{\n}\n"
5: With diff:
5: @@ -1,3 +1,3 @@
5: -void initConsts(double* constants, double* rates, double* states)
5: +void initConsts(double *constants, double *rates, double *states)
5:  {
5:      double &y = *(states + 0);
5: @@ -7,5 +7,5 @@
5:  
5:  }
5: -void computeRates(double voi, double* constants, double* rates, double* states, double* algebraic)
5: +void computeRates(double voi, double *constants, double *rates, double *states, double *algebraic)
5:  {
5:      const double t = voi;
5: @@ -18,5 +18,5 @@
5:  
5:  }
5: -void computeVariables(double voi, double* constants, double* rates, double* states, double* algebraic)
5: +void computeVariables(double voi, double *constants, double *rates, double *states, double *algebraic)
5:  {
5:  }\n
5: 
5: [  FAILED  ] Generator.generateSimpleModel (2 ms)
5: [ RUN      ] Generator.generateComplexModel
5: [       OK ] Generator.generateComplexModel (1 ms)
5: [ RUN      ] Generator.generateComplexModelToFile
5: [       OK ] Generator.generateComplexModelToFile (0 ms)
5: [ RUN      ] Generator.writeWithoutGenerating
5: Caught error: No code was generated yet, you should call Generator::generateCode before calling this method.
5: [       OK ] Generator.writeWithoutGenerating (1 ms)
5: [ RUN      ] Generator.unknownNode
5: Caught error: Found node of unknown type
5: [       OK ] Generator.unknownNode (0 ms)
5: [ RUN      ] Generator.divisionAndPower
5: [       OK ] Generator.divisionAndPower (0 ms)
5: [----------] 6 tests from Generator (4 ms total)
5: 
5: [----------] Global test environment tear-down
5: [==========] 6 tests from 1 test case ran. (4 ms total)
5: [  PASSED  ] 5 tests.
5: [  FAILED  ] 1 test, listed below:
5: [  FAILED  ] Generator.generateSimpleModel
5: 
5:  1 FAILED TEST
 5/35 Test  #5: io_unit_test_generator ...........***Failed    0.02 sec
test 6
      Start  6: entities_unit_test_math

6: Test command: /home/libcellml/buildslave/Unit_Tests_Builder_Ubuntu_14_04_64_Bit/libcellml-build/tests/test_math
6: Test timeout computed to be: 9.99988e+06
6: Running main() from gtest_main.cc
6: [==========] Running 8 tests from 1 test case.
6: [----------] Global test environment set-up.
6: [----------] 8 tests from Maths
6: [ RUN      ] Maths.setAndGetMath
6: [       OK ] Maths.setAndGetMath (0 ms)
6: [ RUN      ] Maths.appendAndSerialiseMathComponent
6: [       OK ] Maths.appendAndSerialiseMathComponent (0 ms)
6: [ RUN      ] Maths.appendAndResetMathComponent
6: [       OK ] Maths.appendAndResetMathComponent (1 ms)
6: [ RUN      ] Maths.appendSerialiseAndParseMathModel
6: [       OK ] Maths.appendSerialiseAndParseMathModel (0 ms)
6: [ RUN      ] Maths.modelWithTwoVariablesAndTwoInvalidMaths
6: [       OK ] Maths.modelWithTwoVariablesAndTwoInvalidMaths (1 ms)
6: [ RUN      ] Maths.modelWithTwoVariablesWithInitialValuesAndInvalidMath
6: [       OK ] Maths.modelWithTwoVariablesWithInitialValuesAndInvalidMath (0 ms)
6: [ RUN      ] Maths.modelWithTwoVariablesWithInitialValuesAndValidMath
6: [       OK ] Maths.modelWithTwoVariablesWithInitialValuesAndValidMath (0 ms)
6: [ RUN      ] Maths.twoComponentsWithMathAndConnectionAndParse
6: [       OK ] Maths.twoComponentsWithMathAndConnectionAndParse (1 ms)
6: [----------] 8 tests from Maths (3 ms total)
6: 
6: [----------] Global test environment tear-down
6: [==========] 8 tests from 1 test case ran. (3 ms total)
6: [  PASSED  ] 8 tests.
 6/35 Test  #6: entities_unit_test_math ..........   Passed    0.01 sec
test 7
      Start  7: entities_unit_test_model

7: Test command: /home/libcellml/buildslave/Unit_Tests_Builder_Ubuntu_14_04_64_Bit/libcellml-build/tests/test_model
7: Test timeout computed to be: 9.99988e+06
7: Running main() from gtest_main.cc
7: [==========] Running 28 tests from 3 test cases.
7: [----------] Global test environment set-up.
7: [----------] 16 tests from Model
7: [ RUN      ] Model.setGetId
7: [       OK ] Model.setGetId (0 ms)
7: [ RUN      ] Model.name
7: [       OK ] Model.name (0 ms)
7: [ RUN      ] Model.unsetName
7: [       OK ] Model.unsetName (0 ms)
7: [ RUN      ] Model.invalidName
7: [       OK ] Model.invalidName (0 ms)
7: [ RUN      ] Model.addComponent
7: [       OK ] Model.addComponent (0 ms)
7: [ RUN      ] Model.addValidNamedComponent
7: [       OK ] Model.addValidNamedComponent (0 ms)
7: [ RUN      ] Model.addInvalidNamedComponent
7: [       OK ] Model.addInvalidNamedComponent (0 ms)
7: [ RUN      ] Model.addTwoNamedComponents
7: [       OK ] Model.addTwoNamedComponents (0 ms)
7: [ RUN      ] Model.countComponents
7: [       OK ] Model.countComponents (0 ms)
7: [ RUN      ] Model.containsComponent
7: [       OK ] Model.containsComponent (0 ms)
7: [ RUN      ] Model.removeComponent
7: [       OK ] Model.removeComponent (0 ms)
7: [ RUN      ] Model.getComponentMethods
7: [       OK ] Model.getComponentMethods (0 ms)
7: [ RUN      ] Model.takeComponentMethods
7: [       OK ] Model.takeComponentMethods (0 ms)
7: [ RUN      ] Model.replaceComponent
7: [       OK ] Model.replaceComponent (0 ms)
7: [ RUN      ] Model.constructors
7: [       OK ] Model.constructors (0 ms)
7: [ RUN      ] Model.setAndCheckIdsAllEntities
7: [       OK ] Model.setAndCheckIdsAllEntities (1 ms)
7: [----------] 16 tests from Model (3 ms total)
7: 
7: [----------] 7 tests from ComponentImport
7: [ RUN      ] ComponentImport.basics
7: [       OK ] ComponentImport.basics (0 ms)
7: [ RUN      ] ComponentImport.singleImportA
7: [       OK ] ComponentImport.singleImportA (0 ms)
7: [ RUN      ] ComponentImport.singleImportB
7: [       OK ] ComponentImport.singleImportB (0 ms)
7: [ RUN      ] ComponentImport.nonExistentURLAndParse
7: [       OK ] ComponentImport.nonExistentURLAndParse (1 ms)
7: [ RUN      ] ComponentImport.multipleImportAndParse
7: [       OK ] ComponentImport.multipleImportAndParse (0 ms)
7: [ RUN      ] ComponentImport.hierarchicalImportAndParse
7: [       OK ] ComponentImport.hierarchicalImportAndParse (0 ms)
7: [ RUN      ] ComponentImport.complexImportAndParse
7: [       OK ] ComponentImport.complexImportAndParse (1 ms)
7: [----------] 7 tests from ComponentImport (2 ms total)
7: 
7: [----------] 5 tests from UnitsImport
7: [ RUN      ] UnitsImport.basics
7: [       OK ] UnitsImport.basics (0 ms)
7: [ RUN      ] UnitsImport.importValidName
7: [       OK ] UnitsImport.importValidName (0 ms)
7: [ RUN      ] UnitsImport.importInvalidName
7: [       OK ] UnitsImport.importInvalidName (0 ms)
7: [ RUN      ] UnitsImport.nonExistentURL
7: [       OK ] UnitsImport.nonExistentURL (0 ms)
7: [ RUN      ] UnitsImport.importModifyAndParse
7: [       OK ] UnitsImport.importModifyAndParse (1 ms)
7: [----------] 5 tests from UnitsImport (1 ms total)
7: 
7: [----------] Global test environment tear-down
7: [==========] 28 tests from 3 test cases ran. (6 ms total)
7: [  PASSED  ] 28 tests.
 7/35 Test  #7: entities_unit_test_model .........   Passed    0.02 sec
test 8
      Start  8: io_unit_test_parser

8: Test command: /home/libcellml/buildslave/Unit_Tests_Builder_Ubuntu_14_04_64_Bit/libcellml-build/tests/test_parser
8: Test timeout computed to be: 9.99988e+06
8: Running main() from gtest_main.cc
8: [==========] Running 67 tests from 1 test case.
8: [----------] Global test environment set-up.
8: [----------] 67 tests from Parser
8: [ RUN      ] Parser.invalidXMLElements
8: [       OK ] Parser.invalidXMLElements (1 ms)
8: [ RUN      ] Parser.parse
8: [       OK ] Parser.parse (0 ms)
8: [ RUN      ] Parser.parseNamedModel
8: [       OK ] Parser.parseNamedModel (0 ms)
8: [ RUN      ] Parser.moveParser
8: [       OK ] Parser.moveParser (0 ms)
8: [ RUN      ] Parser.makeError
8: [       OK ] Parser.makeError (0 ms)
8: [ RUN      ] Parser.emptyModelString
8: [       OK ] Parser.emptyModelString (0 ms)
8: [ RUN      ] Parser.nonXmlString
8: [       OK ] Parser.nonXmlString (1 ms)
8: [ RUN      ] Parser.invalidRootNode
8: [       OK ] Parser.invalidRootNode (0 ms)
8: [ RUN      ] Parser.invalidModelAttribute
8: [       OK ] Parser.invalidModelAttribute (0 ms)
8: [ RUN      ] Parser.invalidModelElement
8: [       OK ] Parser.invalidModelElement (0 ms)
8: [ RUN      ] Parser.modelWithInvalidElement
8: [       OK ] Parser.modelWithInvalidElement (0 ms)
8: [ RUN      ] Parser.parseModelWithInvalidAttributeAndGetError
8: [       OK ] Parser.parseModelWithInvalidAttributeAndGetError (0 ms)
8: [ RUN      ] Parser.parseNamedModelWithNamedComponent
8: [       OK ] Parser.parseNamedModelWithNamedComponent (0 ms)
8: [ RUN      ] Parser.parseModelWithUnitsAndNamedComponent
8: [       OK ] Parser.parseModelWithUnitsAndNamedComponent (1 ms)
8: [ RUN      ] Parser.unitsAttributeError
8: [       OK ] Parser.unitsAttributeError (0 ms)
8: [ RUN      ] Parser.unitsElementErrors
8: [       OK ] Parser.unitsElementErrors (0 ms)
8: [ RUN      ] Parser.parseModelWithNamedComponentWithInvalidBaseUnitsAttributeAndGetError
8: [       OK ] Parser.parseModelWithNamedComponentWithInvalidBaseUnitsAttributeAndGetError (0 ms)
8: [ RUN      ] Parser.parseModelWithInvalidComponentAttributeAndGetError
8: [       OK ] Parser.parseModelWithInvalidComponentAttributeAndGetError (1 ms)
8: [ RUN      ] Parser.componentAttributeErrors
8: [       OK ] Parser.componentAttributeErrors (0 ms)
8: [ RUN      ] Parser.componentElementErrors
8: [       OK ] Parser.componentElementErrors (0 ms)
8: [ RUN      ] Parser.parseModelWithTwoComponents
8: [       OK ] Parser.parseModelWithTwoComponents (0 ms)
8: [ RUN      ] Parser.parseModelWithComponentHierarchyWaterfall
8: [       OK ] Parser.parseModelWithComponentHierarchyWaterfall (0 ms)
8: [ RUN      ] Parser.parseModelWithMultipleComponentHierarchyWaterfalls
8: [       OK ] Parser.parseModelWithMultipleComponentHierarchyWaterfalls (1 ms)
8: [ RUN      ] Parser.modelWithUnits
8: [       OK ] Parser.modelWithUnits (0 ms)
8: [ RUN      ] Parser.modelWithInvalidUnits
8: [       OK ] Parser.modelWithInvalidUnits (0 ms)
8: [ RUN      ] Parser.emptyEncapsulation
8: [       OK ] Parser.emptyEncapsulation (0 ms)
8: [ RUN      ] Parser.encapsulationWithNoComponentAttribute
8: [       OK ] Parser.encapsulationWithNoComponentAttribute (1 ms)
8: [ RUN      ] Parser.encapsulationWithNoComponentRef
8: [       OK ] Parser.encapsulationWithNoComponentRef (0 ms)
8: [ RUN      ] Parser.encapsulationWithNoComponent
8: [       OK ] Parser.encapsulationWithNoComponent (0 ms)
8: [ RUN      ] Parser.encapsulationWithMissingComponent
8: [       OK ] Parser.encapsulationWithMissingComponent (0 ms)
8: [ RUN      ] Parser.encapsulationWithNoComponentChild
8: [       OK ] Parser.encapsulationWithNoComponentChild (0 ms)
8: [ RUN      ] Parser.encapsulationNoChildComponentRef
8: [       OK ] Parser.encapsulationNoChildComponentRef (0 ms)
8: [ RUN      ] Parser.encapsulationWithNoGrandchildComponentRef
8: [       OK ] Parser.encapsulationWithNoGrandchildComponentRef (0 ms)
8: [ RUN      ] Parser.invalidEncapsulations
8: [       OK ] Parser.invalidEncapsulations (0 ms)
8: [ RUN      ] Parser.invalidVariableAttributesAndGetVariableError
8: [       OK ] Parser.invalidVariableAttributesAndGetVariableError (0 ms)
8: [ RUN      ] Parser.variableAttributeAndChildErrors
8: [       OK ] Parser.variableAttributeAndChildErrors (0 ms)
8: [ RUN      ] Parser.emptyConnections
8: [       OK ] Parser.emptyConnections (0 ms)
8: [ RUN      ] Parser.connectionErrorNoComponent2
8: [       OK ] Parser.connectionErrorNoComponent2 (0 ms)
8: [ RUN      ] Parser.connectionErrorNoComponent2InModel
8: [       OK ] Parser.connectionErrorNoComponent2InModel (1 ms)
8: [ RUN      ] Parser.connectionErrorNoComponent1
8: [       OK ] Parser.connectionErrorNoComponent1 (0 ms)
8: [ RUN      ] Parser.connectionErrorNoMapComponents
8: [       OK ] Parser.connectionErrorNoMapComponents (0 ms)
8: [ RUN      ] Parser.connectionErrorNoMapVariables
8: [       OK ] Parser.connectionErrorNoMapVariables (0 ms)
8: [ RUN      ] Parser.importedComponent2Connection
8: [       OK ] Parser.importedComponent2Connection (0 ms)
8: [ RUN      ] Parser.validConnectionMapVariablesFirst
8: [       OK ] Parser.validConnectionMapVariablesFirst (1 ms)
8: [ RUN      ] Parser.component2ConnectionVariableMissing
8: [       OK ] Parser.component2ConnectionVariableMissing (0 ms)
8: [ RUN      ] Parser.component2InConnectionMissing
8: [       OK ] Parser.component2InConnectionMissing (0 ms)
8: [ RUN      ] Parser.connectionVariable2Missing
8: [       OK ] Parser.connectionVariable2Missing (0 ms)
8: [ RUN      ] Parser.connectionVariable1Missing
8: [       OK ] Parser.connectionVariable1Missing (0 ms)
8: [ RUN      ] Parser.connectionErrorNoMapVariablesType
8: [       OK ] Parser.connectionErrorNoMapVariablesType (0 ms)
8: [ RUN      ] Parser.invalidImportsAndGetError
8: [       OK ] Parser.invalidImportsAndGetError (1 ms)
8: [ RUN      ] Parser.invalidModelWithAllKindsOfErrors
8: [       OK ] Parser.invalidModelWithAllKindsOfErrors (0 ms)
8: [ RUN      ] Parser.invalidModelWithTextInAllElements
8: [       OK ] Parser.invalidModelWithTextInAllElements (0 ms)
8: [ RUN      ] Parser.parseIds
8: [       OK ] Parser.parseIds (0 ms)
8: [ RUN      ] Parser.parseIdsOnEverything
8: [       OK ] Parser.parseIdsOnEverything (1 ms)
8: [ RUN      ] Parser.parseResets
8: [       OK ] Parser.parseResets (0 ms)
8: [ RUN      ] Parser.parseResetsWithNumerousErrors
8: [       OK ] Parser.parseResetsWithNumerousErrors (0 ms)
8: [ RUN      ] Parser.parseResetsCheckResetObjectCheckWhenObject
8: [       OK ] Parser.parseResetsCheckResetObjectCheckWhenObject (0 ms)
8: [ RUN      ] Parser.unitsWithCellMLRealVariations
8: [       OK ] Parser.unitsWithCellMLRealVariations (0 ms)
8: [ RUN      ] Parser.xmlComments
8: [       OK ] Parser.xmlComments (1 ms)
8: [ RUN      ] Parser.parseSineModelFromFile
8: [       OK ] Parser.parseSineModelFromFile (1 ms)
8: [ RUN      ] Parser.parseSineImportsModelFromFile
8: [       OK ] Parser.parseSineImportsModelFromFile (1 ms)
8: [ RUN      ] Parser.parseInvalidModelFromFile
8: [       OK ] Parser.parseInvalidModelFromFile (0 ms)
8: [ RUN      ] Parser.parseOrdModelFromFile
8: [       OK ] Parser.parseOrdModelFromFile (33 ms)
8: [ RUN      ] Parser.parseComplexEncapsulationModelFromFile
8: [       OK ] Parser.parseComplexEncapsulationModelFromFile (2 ms)
8: [ RUN      ] Parser.parseModelWithComponentsWithMultipleMathElements
8: [       OK ] Parser.parseModelWithComponentsWithMultipleMathElements (0 ms)
8: [ RUN      ] Parser.parseValidXmlDirectlyUsingLibxml
8: [       OK ] Parser.parseValidXmlDirectlyUsingLibxml (0 ms)
8: [ RUN      ] Parser.parseInvalidXmlDirectlyUsingLibxml
8: /:2: parser error : Opening and ending tag mismatch: component line 2 and model
8: /:2: parser error : Premature end of data in tag model line 2
8: [       OK ] Parser.parseInvalidXmlDirectlyUsingLibxml (1 ms)
8: [----------] 67 tests from Parser (52 ms total)
8: 
8: [----------] Global test environment tear-down
8: [==========] 67 tests from 1 test case ran. (52 ms total)
8: [  PASSED  ] 67 tests.
 8/35 Test  #8: io_unit_test_parser ..............   Passed    0.06 sec
test 9
      Start  9: io_unit_test_printer

9: Test command: /home/libcellml/buildslave/Unit_Tests_Builder_Ubuntu_14_04_64_Bit/libcellml-build/tests/test_printer
9: Test timeout computed to be: 9.99988e+06
9: Running main() from gtest_main.cc
9: [==========] Running 8 tests from 1 test case.
9: [----------] Global test environment set-up.
9: [----------] 8 tests from Printer
9: [ RUN      ] Printer.printEmptyModel
9: [       OK ] Printer.printEmptyModel (0 ms)
9: [ RUN      ] Printer.printEmptyModelAllocatePointer
9: [       OK ] Printer.printEmptyModelAllocatePointer (0 ms)
9: [ RUN      ] Printer.printEmptyUnits
9: [       OK ] Printer.printEmptyUnits (0 ms)
9: [ RUN      ] Printer.printEmptyVariable
9: [       OK ] Printer.printEmptyVariable (0 ms)
9: [ RUN      ] Printer.printEmptyComponent
9: [       OK ] Printer.printEmptyComponent (0 ms)
9: [ RUN      ] Printer.printEmptyReset
9: [       OK ] Printer.printEmptyReset (1 ms)
9: [ RUN      ] Printer.printEncapsulation
9: [       OK ] Printer.printEncapsulation (0 ms)
9: [ RUN      ] Printer.printEncapsulationWithNames
9: [       OK ] Printer.printEncapsulationWithNames (0 ms)
9: [----------] 8 tests from Printer (1 ms total)
9: 
9: [----------] Global test environment tear-down
9: [==========] 8 tests from 1 test case ran. (2 ms total)
9: [  PASSED  ] 8 tests.
 9/35 Test  #9: io_unit_test_printer .............   Passed    0.01 sec
test 10
      Start 10: entities_unit_test_reset

10: Test command: /home/libcellml/buildslave/Unit_Tests_Builder_Ubuntu_14_04_64_Bit/libcellml-build/tests/test_reset
10: Test timeout computed to be: 9.99988e+06
10: Running main() from gtest_main.cc
10: [==========] Running 20 tests from 1 test case.
10: [----------] Global test environment set-up.
10: [----------] 20 tests from Reset
10: [ RUN      ] Reset.create
10: [       OK ] Reset.create (0 ms)
10: [ RUN      ] Reset.order
10: [       OK ] Reset.order (0 ms)
10: [ RUN      ] Reset.addAndCountChildren
10: [       OK ] Reset.addAndCountChildren (0 ms)
10: [ RUN      ] Reset.contains
10: [       OK ] Reset.contains (0 ms)
10: [ RUN      ] Reset.removeWhenMethods
10: [       OK ] Reset.removeWhenMethods (0 ms)
10: [ RUN      ] Reset.getWhenMethods
10: [       OK ] Reset.getWhenMethods (0 ms)
10: [ RUN      ] Reset.takeWhenMethods
10: [       OK ] Reset.takeWhenMethods (0 ms)
10: [ RUN      ] Reset.replaceWhenMethods
10: [       OK ] Reset.replaceWhenMethods (0 ms)
10: [ RUN      ] Reset.constructors
10: [       OK ] Reset.constructors (0 ms)
10: [ RUN      ] Reset.printResetWithVariable
10: [       OK ] Reset.printResetWithVariable (0 ms)
10: [ RUN      ] Reset.printResetWithOrder
10: [       OK ] Reset.printResetWithOrder (0 ms)
10: [ RUN      ] Reset.printResetWithOrderAndVariable
10: [       OK ] Reset.printResetWithOrderAndVariable (0 ms)
10: [ RUN      ] Reset.printResetWithWhen
10: [       OK ] Reset.printResetWithWhen (0 ms)
10: [ RUN      ] Reset.printResetWithMultipleWhens
10: [       OK ] Reset.printResetWithMultipleWhens (0 ms)
10: [ RUN      ] Reset.printResetWithWhenWithValueSet
10: [       OK ] Reset.printResetWithWhenWithValueSet (0 ms)
10: [ RUN      ] Reset.printResetWithMultipleWhensWithValues
10: [       OK ] Reset.printResetWithMultipleWhensWithValues (0 ms)
10: [ RUN      ] Reset.printResetWithMultipleWhensWithOrders
10: [       OK ] Reset.printResetWithMultipleWhensWithOrders (0 ms)
10: [ RUN      ] Reset.addRemoveResetFromComponentMethods
10: [       OK ] Reset.addRemoveResetFromComponentMethods (0 ms)
10: [ RUN      ] Reset.getResetFromComponentMethod
10: [       OK ] Reset.getResetFromComponentMethod (0 ms)
10: [ RUN      ] Reset.hasResetFromComponentMethod
10: [       OK ] Reset.hasResetFromComponentMethod (0 ms)
10: [----------] 20 tests from Reset (2 ms total)
10: 
10: [----------] Global test environment tear-down
10: [==========] 20 tests from 1 test case ran. (2 ms total)
10: [  PASSED  ] 20 tests.
10/35 Test #10: entities_unit_test_reset .........   Passed    0.01 sec
test 11
      Start 11: io_unit_test_resolve_imports

11: Test command: /home/libcellml/buildslave/Unit_Tests_Builder_Ubuntu_14_04_64_Bit/libcellml-build/tests/test_resolve_imports
11: Test timeout computed to be: 9.99988e+06
11: Running main() from gtest_main.cc
11: [==========] Running 6 tests from 1 test case.
11: [----------] Global test environment set-up.
11: [----------] 6 tests from ResolveImports
11: [ RUN      ] ResolveImports.resolveSineModelFromFile
11: [       OK ] ResolveImports.resolveSineModelFromFile (2 ms)
11: [ RUN      ] ResolveImports.resolveSineImportsModelFromFile
11: [       OK ] ResolveImports.resolveSineImportsModelFromFile (2 ms)
11: [ RUN      ] ResolveImports.resolveComplexImportsModelFromFile
11: [       OK ] ResolveImports.resolveComplexImportsModelFromFile (3 ms)
11: [ RUN      ] ResolveImports.resolveUnitsImportFromFile
11: [       OK ] ResolveImports.resolveUnitsImportFromFile (1 ms)
11: [ RUN      ] ResolveImports.resolveImportsFromFileLevel0
11: [       OK ] ResolveImports.resolveImportsFromFileLevel0 (3 ms)
11: [ RUN      ] ResolveImports.resolveImportsFromFileLevel0Unresolvable
11: [       OK ] ResolveImports.resolveImportsFromFileLevel0Unresolvable (3 ms)
11: [----------] 6 tests from ResolveImports (14 ms total)
11: 
11: [----------] Global test environment tear-down
11: [==========] 6 tests from 1 test case ran. (14 ms total)
11: [  PASSED  ] 6 tests.
11/35 Test #11: io_unit_test_resolve_imports .....   Passed    0.03 sec
test 12
      Start 12: entities_unit_test_units

12: Test command: /home/libcellml/buildslave/Unit_Tests_Builder_Ubuntu_14_04_64_Bit/libcellml-build/tests/test_units
12: Test timeout computed to be: 9.99988e+06
12: Running main() from gtest_main.cc
12: [==========] Running 19 tests from 1 test case.
12: [----------] Global test environment set-up.
12: [----------] 19 tests from Units
12: [ RUN      ] Units.validName
12: [       OK ] Units.validName (0 ms)
12: [ RUN      ] Units.invalidName
12: [       OK ] Units.invalidName (0 ms)
12: [ RUN      ] Units.compoundUnitsRaw
12: [       OK ] Units.compoundUnitsRaw (1 ms)
12: [ RUN      ] Units.addUnitsVariations
12: [       OK ] Units.addUnitsVariations (0 ms)
12: [ RUN      ] Units.compoundUnitsUsingDefines
12: [       OK ] Units.compoundUnitsUsingDefines (0 ms)
12: [ RUN      ] Units.compoundUnitsUsingDefinesAndStringUnitsAndPrefix
12: [       OK ] Units.compoundUnitsUsingDefinesAndStringUnitsAndPrefix (0 ms)
12: [ RUN      ] Units.removeUnitsMethodsAndCount
12: [       OK ] Units.removeUnitsMethodsAndCount (0 ms)
12: [ RUN      ] Units.hasUnitsName
12: [       OK ] Units.hasUnitsName (0 ms)
12: [ RUN      ] Units.hasUnitsPtr
12: [       OK ] Units.hasUnitsPtr (1 ms)
12: [ RUN      ] Units.takeUnits
12: [       OK ] Units.takeUnits (0 ms)
12: [ RUN      ] Units.replaceUnits
12: [       OK ] Units.replaceUnits (0 ms)
12: [ RUN      ] Units.multiply
12: [       OK ] Units.multiply (0 ms)
12: [ RUN      ] Units.newBaseUnit
12: [       OK ] Units.newBaseUnit (0 ms)
12: [ RUN      ] Units.isBaseUnit
12: [       OK ] Units.isBaseUnit (0 ms)
12: [ RUN      ] Units.farhenheit
12: [       OK ] Units.farhenheit (0 ms)
12: [ RUN      ] Units.getUnitAttributes
12: [       OK ] Units.getUnitAttributes (0 ms)
12: [ RUN      ] Units.multipleUnitUsingStandardRef
12: [       OK ] Units.multipleUnitUsingStandardRef (0 ms)
12: [ RUN      ] Units.removeUnit
12: [       OK ] Units.removeUnit (0 ms)
12: [ RUN      ] Units.multipleAndParse
12: [       OK ] Units.multipleAndParse (1 ms)
12: [----------] 19 tests from Units (3 ms total)
12: 
12: [----------] Global test environment tear-down
12: [==========] 19 tests from 1 test case ran. (4 ms total)
12: [  PASSED  ] 19 tests.
12/35 Test #12: entities_unit_test_units .........   Passed    0.02 sec
test 13
      Start 13: io_unit_test_validator

13: Test command: /home/libcellml/buildslave/Unit_Tests_Builder_Ubuntu_14_04_64_Bit/libcellml-build/tests/test_validator
13: Test timeout computed to be: 9.99988e+06
13: Running main() from gtest_main.cc
13: [==========] Running 22 tests from 1 test case.
13: [----------] Global test environment set-up.
13: [----------] 22 tests from Validator
13: [ RUN      ] Validator.namedModel
13: [       OK ] Validator.namedModel (0 ms)
13: [ RUN      ] Validator.unnamedModel
13: [       OK ] Validator.unnamedModel (0 ms)
13: [ RUN      ] Validator.invalidCellMLIdentifiersWithSpecificationHeading
13: [       OK ] Validator.invalidCellMLIdentifiersWithSpecificationHeading (0 ms)
13: [ RUN      ] Validator.moveCopyValidatorWithUnnamedModel
13: [       OK ] Validator.moveCopyValidatorWithUnnamedModel (0 ms)
13: [ RUN      ] Validator.namedModelWithUnnamedComponent
13: [       OK ] Validator.namedModelWithUnnamedComponent (0 ms)
13: [ RUN      ] Validator.unnamedModelWithUnnamedComponentWithUnnamedUnits
13: [       OK ] Validator.unnamedModelWithUnnamedComponentWithUnnamedUnits (0 ms)
13: [ RUN      ] Validator.modelWithDuplicateComponentsAndUnits
13: [       OK ] Validator.modelWithDuplicateComponentsAndUnits (0 ms)
13: [ RUN      ] Validator.unnamedAndDuplicateNamedVariablesWithAndWithoutValidUnits
13: [       OK ] Validator.unnamedAndDuplicateNamedVariablesWithAndWithoutValidUnits (1 ms)
13: [ RUN      ] Validator.invalidVariableInitialValuesAndInterfaces
13: [       OK ] Validator.invalidVariableInitialValuesAndInterfaces (0 ms)
13: [ RUN      ] Validator.importUnits
13: [       OK ] Validator.importUnits (0 ms)
13: [ RUN      ] Validator.importComponents
13: [       OK ] Validator.importComponents (0 ms)
13: [ RUN      ] Validator.validMath
13: [       OK ] Validator.validMath (20 ms)
13: [ RUN      ] Validator.invalidMath
13: [       OK ] Validator.invalidMath (0 ms)
13: [ RUN      ] Validator.invalidMathMLElements
13: [       OK ] Validator.invalidMathMLElements (17 ms)
13: [ RUN      ] Validator.invalidMathMLVariables
13: [       OK ] Validator.invalidMathMLVariables (17 ms)
13: [ RUN      ] Validator.invalidMathMLCiAndCnElementsWithCellMLUnits
13: [       OK ] Validator.invalidMathMLCiAndCnElementsWithCellMLUnits (17 ms)
13: [ RUN      ] Validator.parseAndValidateInvalidUnitErrors
13: [       OK ] Validator.parseAndValidateInvalidUnitErrors (0 ms)
13: [ RUN      ] Validator.validateInvalidConnections
13: [       OK ] Validator.validateInvalidConnections (1 ms)
13: [ RUN      ] Validator.integerStrings
13: [       OK ] Validator.integerStrings (170 ms)
13: [ RUN      ] Validator.resets
13: [       OK ] Validator.resets (135 ms)
13: [ RUN      ] Validator.whens
13: [       OK ] Validator.whens (54 ms)
13: [ RUN      ] Validator.validMathCnElements
13: [       OK ] Validator.validMathCnElements (16 ms)
13: [----------] 22 tests from Validator (449 ms total)
13: 
13: [----------] Global test environment tear-down
13: [==========] 22 tests from 1 test case ran. (449 ms total)
13: [  PASSED  ] 22 tests.
13/35 Test #13: io_unit_test_validator ...........   Passed    0.46 sec
test 14
      Start 14: entities_unit_test_variable

14: Test command: /home/libcellml/buildslave/Unit_Tests_Builder_Ubuntu_14_04_64_Bit/libcellml-build/tests/test_variable
14: Test timeout computed to be: 9.99988e+06
14: Running main() from gtest_main.cc
14: [==========] Running 37 tests from 1 test case.
14: [----------] Global test environment set-up.
14: [----------] 37 tests from Variable
14: [ RUN      ] Variable.setValidVariableName
14: [       OK ] Variable.setValidVariableName (0 ms)
14: [ RUN      ] Variable.setInvalidVariableName
14: [       OK ] Variable.setInvalidVariableName (0 ms)
14: [ RUN      ] Variable.getValidVariableName
14: [       OK ] Variable.getValidVariableName (0 ms)
14: [ RUN      ] Variable.getInvalidVariableName
14: [       OK ] Variable.getInvalidVariableName (0 ms)
14: [ RUN      ] Variable.setUnits
14: [       OK ] Variable.setUnits (0 ms)
14: [ RUN      ] Variable.setUnitsAndName
14: [       OK ] Variable.setUnitsAndName (0 ms)
14: [ RUN      ] Variable.setInitialValueByString
14: [       OK ] Variable.setInitialValueByString (0 ms)
14: [ RUN      ] Variable.setInitialValueByDouble
14: [       OK ] Variable.setInitialValueByDouble (0 ms)
14: [ RUN      ] Variable.setInitialValueByReference
14: [       OK ] Variable.setInitialValueByReference (0 ms)
14: [ RUN      ] Variable.getUnsetInitialValue
14: [       OK ] Variable.getUnsetInitialValue (0 ms)
14: [ RUN      ] Variable.getSetInitialValue
14: [       OK ] Variable.getSetInitialValue (0 ms)
14: [ RUN      ] Variable.setInterfaceTypeByInvalidString
14: [       OK ] Variable.setInterfaceTypeByInvalidString (0 ms)
14: [ RUN      ] Variable.setInterfaceTypeNoneByValidString
14: [       OK ] Variable.setInterfaceTypeNoneByValidString (0 ms)
14: [ RUN      ] Variable.setInterfaceTypeNoneByEnum
14: [       OK ] Variable.setInterfaceTypeNoneByEnum (0 ms)
14: [ RUN      ] Variable.setInterfaceTypePrivate
14: [       OK ] Variable.setInterfaceTypePrivate (0 ms)
14: [ RUN      ] Variable.setInterfaceTypePublic
14: [       OK ] Variable.setInterfaceTypePublic (0 ms)
14: [ RUN      ] Variable.setInterfaceTypePublicAndPrivate
14: [       OK ] Variable.setInterfaceTypePublicAndPrivate (0 ms)
14: [ RUN      ] Variable.setGetInterfaceType
14: [       OK ] Variable.setGetInterfaceType (0 ms)
14: [ RUN      ] Variable.addVariable
14: [       OK ] Variable.addVariable (0 ms)
14: [ RUN      ] Variable.getParentComponent
14: [       OK ] Variable.getParentComponent (0 ms)
14: [ RUN      ] Variable.getNullParentComponent
14: [       OK ] Variable.getNullParentComponent (0 ms)
14: [ RUN      ] Variable.addVariableToUnnamedComponent
14: [       OK ] Variable.addVariableToUnnamedComponent (0 ms)
14: [ RUN      ] Variable.addTwoVariables
14: [       OK ] Variable.addTwoVariables (0 ms)
14: [ RUN      ] Variable.addVariablesWithAndWithoutNameAndUnits
14: [       OK ] Variable.addVariablesWithAndWithoutNameAndUnits (0 ms)
14: [ RUN      ] Variable.componentWithTwoVariablesWithInitialValues
14: [       OK ] Variable.componentWithTwoVariablesWithInitialValues (1 ms)
14: [ RUN      ] Variable.removeVariableMethods
14: [       OK ] Variable.removeVariableMethods (0 ms)
14: [ RUN      ] Variable.getVariableMethods
14: [       OK ] Variable.getVariableMethods (0 ms)
14: [ RUN      ] Variable.modelWithComponentWithVariableWithValidName
14: [       OK ] Variable.modelWithComponentWithVariableWithValidName (0 ms)
14: [ RUN      ] Variable.modelWithComponentWithVariableWithInvalidName
14: [       OK ] Variable.modelWithComponentWithVariableWithInvalidName (0 ms)
14: [ RUN      ] Variable.modelWithComponentWithVariableWithInvalidUnitsNameAndParse
14: [       OK ] Variable.modelWithComponentWithVariableWithInvalidUnitsNameAndParse (0 ms)
14: [ RUN      ] Variable.modelWithComponentWithTwoNamedVariablesWithInitialValues
14: [       OK ] Variable.modelWithComponentWithTwoNamedVariablesWithInitialValues (0 ms)
14: [ RUN      ] Variable.modelWithComponentWithTwoNamedVariablesWithInitialValuesOneReferenced
14: [       OK ] Variable.modelWithComponentWithTwoNamedVariablesWithInitialValuesOneReferenced (0 ms)
14: [ RUN      ] Variable.modelWithComponentWithTwoNamedVariablesWithInitialValuesAndParse
14: [       OK ] Variable.modelWithComponentWithTwoNamedVariablesWithInitialValuesAndParse (1 ms)
14: [ RUN      ] Variable.modelWithComponentWithFourNamedVariablesWithInterfaces
14: [       OK ] Variable.modelWithComponentWithFourNamedVariablesWithInterfaces (0 ms)
14: [ RUN      ] Variable.modelWithComponentWithFourNamedVariablesWithInterfacesAndParse
14: [       OK ] Variable.modelWithComponentWithFourNamedVariablesWithInterfacesAndParse (0 ms)
14: [ RUN      ] Variable.modelWithComponentWithFiveNamedVariablesWithInterfacesAndParse
14: [       OK ] Variable.modelWithComponentWithFiveNamedVariablesWithInterfacesAndParse (0 ms)
14: [ RUN      ] Variable.modelUnitsAttributeBeforeNameAttribute
14: [       OK ] Variable.modelUnitsAttributeBeforeNameAttribute (0 ms)
14: [----------] 37 tests from Variable (2 ms total)
14: 
14: [----------] Global test environment tear-down
14: [==========] 37 tests from 1 test case ran. (2 ms total)
14: [  PASSED  ] 37 tests.
14/35 Test #14: entities_unit_test_variable ......   Passed    0.01 sec
test 15
      Start 15: api_unit_test_version

15: Test command: /home/libcellml/buildslave/Unit_Tests_Builder_Ubuntu_14_04_64_Bit/libcellml-build/tests/test_version
15: Test timeout computed to be: 9.99988e+06
15: Running main() from gtest_main.cc
15: [==========] Running 1 test from 1 test case.
15: [----------] Global test environment set-up.
15: [----------] 1 test from Version
15: [ RUN      ] Version.versionMatch
15: [       OK ] Version.versionMatch (0 ms)
15: [----------] 1 test from Version (0 ms total)
15: 
15: [----------] Global test environment tear-down
15: [==========] 1 test from 1 test case ran. (1 ms total)
15: [  PASSED  ] 1 test.
15/35 Test #15: api_unit_test_version ............   Passed    0.01 sec
test 16
      Start 16: entities_unit_test_when

16: Test command: /home/libcellml/buildslave/Unit_Tests_Builder_Ubuntu_14_04_64_Bit/libcellml-build/tests/test_when
16: Test timeout computed to be: 9.99988e+06
16: Running main() from gtest_main.cc
16: [==========] Running 4 tests from 1 test case.
16: [----------] Global test environment set-up.
16: [----------] 4 tests from When
16: [ RUN      ] When.create
16: [       OK ] When.create (0 ms)
16: [ RUN      ] When.condition
16: [       OK ] When.condition (0 ms)
16: [ RUN      ] When.value
16: [       OK ] When.value (0 ms)
16: [ RUN      ] When.order
16: [       OK ] When.order (0 ms)
16: [----------] 4 tests from When (1 ms total)
16: 
16: [----------] Global test environment tear-down
16: [==========] 4 tests from 1 test case ran. (1 ms total)
16: [  PASSED  ] 4 tests.
16/35 Test #16: entities_unit_test_when ..........   Passed    0.01 sec
test 17
      Start 17: python_test_component

17: Test command: /usr/bin/python2.7 "test_component.py"
17: Environment variables: 
17:  PYTHONPATH=/home/libcellml/buildslave/Unit_Tests_Builder_Ubuntu_14_04_64_Bit/libcellml-build/src/bindings/python
17: Test timeout computed to be: 9.99988e+06
17: ...........
17: ----------------------------------------------------------------------
17: Ran 11 tests in 0.033s
17: 
17: OK
17/35 Test #17: python_test_component ............   Passed    0.06 sec
test 18
      Start 18: python_test_component_entity

18: Test command: /usr/bin/python2.7 "test_component_entity.py"
18: Environment variables: 
18:  PYTHONPATH=/home/libcellml/buildslave/Unit_Tests_Builder_Ubuntu_14_04_64_Bit/libcellml-build/src/bindings/python
18: Test timeout computed to be: 9.99988e+06
18: ............
18: ----------------------------------------------------------------------
18: Ran 12 tests in 0.028s
18: 
18: OK
18/35 Test #18: python_test_component_entity .....   Passed    0.07 sec
test 19
      Start 19: python_test_entity

19: Test command: /usr/bin/python2.7 "test_entity.py"
19: Environment variables: 
19:  PYTHONPATH=/home/libcellml/buildslave/Unit_Tests_Builder_Ubuntu_14_04_64_Bit/libcellml-build/src/bindings/python
19: Test timeout computed to be: 9.99988e+06
19: .......
19: ----------------------------------------------------------------------
19: Ran 7 tests in 0.023s
19: 
19: OK
19/35 Test #19: python_test_entity ...............   Passed    0.06 sec
test 20
      Start 20: python_test_error

20: Test command: /usr/bin/python2.7 "test_error.py"
20: Environment variables: 
20:  PYTHONPATH=/home/libcellml/buildslave/Unit_Tests_Builder_Ubuntu_14_04_64_Bit/libcellml-build/src/bindings/python
20: Test timeout computed to be: 9.99988e+06
20: .........................
20: ----------------------------------------------------------------------
20: Ran 25 tests in 0.017s
20: 
20: OK
20/35 Test #20: python_test_error ................   Passed    0.04 sec
test 21
      Start 21: python_test_import_source

21: Test command: /usr/bin/python2.7 "test_import_source.py"
21: Environment variables: 
21:  PYTHONPATH=/home/libcellml/buildslave/Unit_Tests_Builder_Ubuntu_14_04_64_Bit/libcellml-build/src/bindings/python
21: Test timeout computed to be: 9.99988e+06
21: .......
21: ----------------------------------------------------------------------
21: Ran 7 tests in 0.016s
21: 
21: OK
21/35 Test #21: python_test_import_source ........   Passed    0.04 sec
test 22
      Start 22: python_test_imported_entity

22: Test command: /usr/bin/python2.7 "test_imported_entity.py"
22: Environment variables: 
22:  PYTHONPATH=/home/libcellml/buildslave/Unit_Tests_Builder_Ubuntu_14_04_64_Bit/libcellml-build/src/bindings/python
22: Test timeout computed to be: 9.99988e+06
22: ......
22: ----------------------------------------------------------------------
22: Ran 6 tests in 0.016s
22: 
22: OK
22/35 Test #22: python_test_imported_entity ......   Passed    0.04 sec
test 23
      Start 23: python_test_logger

23: Test command: /usr/bin/python2.7 "test_logger.py"
23: Environment variables: 
23:  PYTHONPATH=/home/libcellml/buildslave/Unit_Tests_Builder_Ubuntu_14_04_64_Bit/libcellml-build/src/bindings/python
23: Test timeout computed to be: 9.99988e+06
23: .....
23: ----------------------------------------------------------------------
23: Ran 5 tests in 0.016s
23: 
23: OK
23/35 Test #23: python_test_logger ...............   Passed    0.04 sec
test 24
      Start 24: python_test_model

24: Test command: /usr/bin/python2.7 "test_model.py"
24: Environment variables: 
24:  PYTHONPATH=/home/libcellml/buildslave/Unit_Tests_Builder_Ubuntu_14_04_64_Bit/libcellml-build/src/bindings/python
24: Test timeout computed to be: 9.99988e+06
24: ............
24: ----------------------------------------------------------------------
24: Ran 12 tests in 0.016s
24: 
24: OK
24/35 Test #24: python_test_model ................   Passed    0.04 sec
test 25
      Start 25: python_test_named_entity

25: Test command: /usr/bin/python2.7 "test_named_entity.py"
25: Environment variables: 
25:  PYTHONPATH=/home/libcellml/buildslave/Unit_Tests_Builder_Ubuntu_14_04_64_Bit/libcellml-build/src/bindings/python
25: Test timeout computed to be: 9.99988e+06
25: ....
25: ----------------------------------------------------------------------
25: Ran 4 tests in 0.016s
25: 
25: OK
25/35 Test #25: python_test_named_entity .........   Passed    0.04 sec
test 26
      Start 26: python_test_ordered_entity

26: Test command: /usr/bin/python2.7 "test_ordered_entity.py"
26: Environment variables: 
26:  PYTHONPATH=/home/libcellml/buildslave/Unit_Tests_Builder_Ubuntu_14_04_64_Bit/libcellml-build/src/bindings/python
26: Test timeout computed to be: 9.99988e+06
26: ....
26: ----------------------------------------------------------------------
26: Ran 4 tests in 0.016s
26: 
26: OK
26/35 Test #26: python_test_ordered_entity .......   Passed    0.04 sec
test 27
      Start 27: python_test_parser

27: Test command: /usr/bin/python2.7 "test_parser.py"
27: Environment variables: 
27:  PYTHONPATH=/home/libcellml/buildslave/Unit_Tests_Builder_Ubuntu_14_04_64_Bit/libcellml-build/src/bindings/python
27: Test timeout computed to be: 9.99988e+06
27: ...
27: ----------------------------------------------------------------------
27: Ran 3 tests in 0.016s
27: 
27: OK
27/35 Test #27: python_test_parser ...............   Passed    0.04 sec
test 28
      Start 28: python_test_printer

28: Test command: /usr/bin/python2.7 "test_printer.py"
28: Environment variables: 
28:  PYTHONPATH=/home/libcellml/buildslave/Unit_Tests_Builder_Ubuntu_14_04_64_Bit/libcellml-build/src/bindings/python
28: Test timeout computed to be: 9.99988e+06
28: .......
28: ----------------------------------------------------------------------
28: Ran 7 tests in 0.017s
28: 
28: OK
28/35 Test #28: python_test_printer ..............   Passed    0.04 sec
test 29
      Start 29: python_test_reset

29: Test command: /usr/bin/python2.7 "test_reset.py"
29: Environment variables: 
29:  PYTHONPATH=/home/libcellml/buildslave/Unit_Tests_Builder_Ubuntu_14_04_64_Bit/libcellml-build/src/bindings/python
29: Test timeout computed to be: 9.99988e+06
29: .........
29: ----------------------------------------------------------------------
29: Ran 9 tests in 0.016s
29: 
29: OK
29/35 Test #29: python_test_reset ................   Passed    0.04 sec
test 30
      Start 30: python_test_units

30: Test command: /usr/bin/python2.7 "test_units.py"
30: Environment variables: 
30:  PYTHONPATH=/home/libcellml/buildslave/Unit_Tests_Builder_Ubuntu_14_04_64_Bit/libcellml-build/src/bindings/python
30: Test timeout computed to be: 9.99988e+06
30: ...........
30: ----------------------------------------------------------------------
30: Ran 11 tests in 0.017s
30: 
30: OK
30/35 Test #30: python_test_units ................   Passed    0.04 sec
test 31
      Start 31: python_test_variable

31: Test command: /usr/bin/python2.7 "test_variable.py"
31: Environment variables: 
31:  PYTHONPATH=/home/libcellml/buildslave/Unit_Tests_Builder_Ubuntu_14_04_64_Bit/libcellml-build/src/bindings/python
31: Test timeout computed to be: 9.99988e+06
31: ...............
31: ----------------------------------------------------------------------
31: Ran 15 tests in 0.016s
31: 
31: OK
31/35 Test #31: python_test_variable .............   Passed    0.04 sec
test 32
      Start 32: python_test_validator

32: Test command: /usr/bin/python2.7 "test_validator.py"
32: Environment variables: 
32:  PYTHONPATH=/home/libcellml/buildslave/Unit_Tests_Builder_Ubuntu_14_04_64_Bit/libcellml-build/src/bindings/python
32: Test timeout computed to be: 9.99988e+06
32: ...
32: ----------------------------------------------------------------------
32: Ran 3 tests in 0.016s
32: 
32: OK
32/35 Test #32: python_test_validator ............   Passed    0.04 sec
test 33
      Start 33: python_test_version

33: Test command: /usr/bin/python2.7 "test_version.py"
33: Environment variables: 
33:  PYTHONPATH=/home/libcellml/buildslave/Unit_Tests_Builder_Ubuntu_14_04_64_Bit/libcellml-build/src/bindings/python
33: Test timeout computed to be: 9.99988e+06
33: .
33: ----------------------------------------------------------------------
33: Ran 1 test in 0.015s
33: 
33: OK
33/35 Test #33: python_test_version ..............   Passed    0.04 sec
test 34
      Start 34: python_test_when

34: Test command: /usr/bin/python2.7 "test_when.py"
34: Environment variables: 
34:  PYTHONPATH=/home/libcellml/buildslave/Unit_Tests_Builder_Ubuntu_14_04_64_Bit/libcellml-build/src/bindings/python
34: Test timeout computed to be: 9.99988e+06
34: ......
34: ----------------------------------------------------------------------
34: Ran 6 tests in 0.016s
34: 
34: OK
34/35 Test #34: python_test_when .................   Passed    0.04 sec
test 35
      Start 35: python_test_docstrings

35: Test command: /usr/bin/python2.7 "test_docstrings.py"
35: Environment variables: 
35:  PYTHONPATH=/home/libcellml/buildslave/Unit_Tests_Builder_Ubuntu_14_04_64_Bit/libcellml-build/src/bindings/python
35: Test timeout computed to be: 9.99988e+06
35: .
35: ----------------------------------------------------------------------
35: Ran 1 test in 0.016s
35: 
35: OK
35/35 Test #35: python_test_docstrings ...........   Passed    0.04 sec

97% tests passed, 1 tests failed out of 35

Total Test time (real) =   1.60 sec

The following tests FAILED:
	  5 - io_unit_test_generator (Failed)
Errors while running CTest
program finished with exit code 8
elapsedTime=1.609360