(view as text)
cmake --build .
 in dir /Users/libcellml/BuildSlave/Unit_Tests_Builder_Mac_OSX_10_12/libcellml-build (timeout 1200 secs)
 watching logfiles {}
 argv: ['cmake', '--build', '.']
 environment:
  HOME=/Users/libcellml
  LOGNAME=libcellml
  PATH=/usr/local/bin:/usr/bin:/bin:/usr/sbin:/sbin
  PWD=/Users/libcellml/BuildSlave/Unit_Tests_Builder_Mac_OSX_10_12/libcellml-build
  SHELL=/bin/bash
  TMPDIR=/var/folders/cx/hvwlszcd0zs_5hkzc6spk9jm0000gq/T/
  USER=libcellml
  VERSIONER_PYTHON_PREFER_32_BIT=no
  VERSIONER_PYTHON_VERSION=2.7
  XPC_FLAGS=0x0
  XPC_SERVICE_NAME=net.sourceforge.buildbot.slave.libcellml
  __CF_USER_TEXT_ENCODING=0x1F7:0x0:0x0
 using PTY: False
Scanning dependencies of target cellml
[  1%] Building CXX object src/CMakeFiles/cellml.dir/component.cpp.o
[  1%] Building CXX object src/CMakeFiles/cellml.dir/componententity.cpp.o
[  2%] Building CXX object src/CMakeFiles/cellml.dir/entity.cpp.o
[  3%] Building CXX object src/CMakeFiles/cellml.dir/error.cpp.o
[  3%] Building CXX object src/CMakeFiles/cellml.dir/generator.cpp.o
[  4%] Building CXX object src/CMakeFiles/cellml.dir/importedentity.cpp.o
[  5%] Building CXX object src/CMakeFiles/cellml.dir/importsource.cpp.o
[  5%] Building CXX object src/CMakeFiles/cellml.dir/logger.cpp.o
[  6%] Building CXX object src/CMakeFiles/cellml.dir/model.cpp.o
[  7%] Building CXX object src/CMakeFiles/cellml.dir/namedentity.cpp.o
[  7%] Building CXX object src/CMakeFiles/cellml.dir/operatorLibrary.cpp.o
[  8%] Building CXX object src/CMakeFiles/cellml.dir/orderedentity.cpp.o
[  9%] Building CXX object src/CMakeFiles/cellml.dir/parser.cpp.o
[  9%] Building CXX object src/CMakeFiles/cellml.dir/printer.cpp.o
[ 10%] Building CXX object src/CMakeFiles/cellml.dir/reset.cpp.o
[ 11%] Building CXX object src/CMakeFiles/cellml.dir/units.cpp.o
[ 11%] Building CXX object src/CMakeFiles/cellml.dir/utilities.cpp.o
[ 12%] Building CXX object src/CMakeFiles/cellml.dir/validator.cpp.o
[ 13%] Building CXX object src/CMakeFiles/cellml.dir/variable.cpp.o
[ 13%] Building CXX object src/CMakeFiles/cellml.dir/version.cpp.o
[ 14%] Building CXX object src/CMakeFiles/cellml.dir/when.cpp.o
[ 15%] Building CXX object src/CMakeFiles/cellml.dir/xmlattribute.cpp.o
[ 15%] Building CXX object src/CMakeFiles/cellml.dir/xmldoc.cpp.o
[ 16%] Building CXX object src/CMakeFiles/cellml.dir/xmlnode.cpp.o
[ 17%] Linking CXX shared library libcellmld.dylib
[ 17%] Built target cellml
Scanning dependencies of target gen_reset_resetPYTHON_wrap
[ 17%] Swig source
[ 17%] Built target gen_reset_resetPYTHON_wrap
Scanning dependencies of target _reset
[ 18%] Building CXX object src/bindings/python/CMakeFiles/_reset.dir/libcellml/resetPYTHON_wrap.cxx.o
[ 18%] Linking CXX shared module _reset.so
[ 18%] Built target _reset
Scanning dependencies of target gen_when_whenPYTHON_wrap
[ 18%] Swig source
[ 18%] Built target gen_when_whenPYTHON_wrap
Scanning dependencies of target _when
[ 18%] Building CXX object src/bindings/python/CMakeFiles/_when.dir/libcellml/whenPYTHON_wrap.cxx.o
[ 20%] Linking CXX shared module _when.so
[ 20%] Built target _when
Scanning dependencies of target gen_variable_variablePYTHON_wrap
[ 21%] Swig source
[ 21%] Built target gen_variable_variablePYTHON_wrap
Scanning dependencies of target _variable
[ 22%] Building CXX object src/bindings/python/CMakeFiles/_variable.dir/libcellml/variablePYTHON_wrap.cxx.o
[ 23%] Linking CXX shared module _variable.so
[ 23%] Built target _variable
Scanning dependencies of target gen_version_versionPYTHON_wrap
[ 24%] Swig source
[ 24%] Built target gen_version_versionPYTHON_wrap
Scanning dependencies of target _version
[ 24%] Building CXX object src/bindings/python/CMakeFiles/_version.dir/libcellml/versionPYTHON_wrap.cxx.o
[ 25%] Linking CXX shared module _version.so
[ 25%] Built target _version
Scanning dependencies of target gen_validator_validatorPYTHON_wrap
[ 25%] Swig source
[ 25%] Built target gen_validator_validatorPYTHON_wrap
Scanning dependencies of target _validator
[ 26%] Building CXX object src/bindings/python/CMakeFiles/_validator.dir/libcellml/validatorPYTHON_wrap.cxx.o
[ 26%] Linking CXX shared module _validator.so
[ 26%] Built target _validator
Scanning dependencies of target gen_units_unitsPYTHON_wrap
[ 27%] Swig source
[ 27%] Built target gen_units_unitsPYTHON_wrap
Scanning dependencies of target _units
[ 27%] Building CXX object src/bindings/python/CMakeFiles/_units.dir/libcellml/unitsPYTHON_wrap.cxx.o
[ 28%] Linking CXX shared module _units.so
[ 28%] Built target _units
Scanning dependencies of target gen_specificationrule_specificationrulePYTHON_wrap
[ 29%] Swig source
[ 29%] Built target gen_specificationrule_specificationrulePYTHON_wrap
Scanning dependencies of target _specificationrule
[ 30%] Building CXX object src/bindings/python/CMakeFiles/_specificationrule.dir/libcellml/specificationrulePYTHON_wrap.cxx.o
[ 31%] Linking CXX shared module _specificationrule.so
[ 31%] Built target _specificationrule
Scanning dependencies of target gen_printer_printerPYTHON_wrap
[ 32%] Swig source
[ 32%] Built target gen_printer_printerPYTHON_wrap
Scanning dependencies of target _printer
[ 32%] Building CXX object src/bindings/python/CMakeFiles/_printer.dir/libcellml/printerPYTHON_wrap.cxx.o
[ 33%] Linking CXX shared module _printer.so
[ 33%] Built target _printer
Scanning dependencies of target gen_parser_parserPYTHON_wrap
[ 34%] Swig source
[ 34%] Built target gen_parser_parserPYTHON_wrap
Scanning dependencies of target _parser
[ 35%] Building CXX object src/bindings/python/CMakeFiles/_parser.dir/libcellml/parserPYTHON_wrap.cxx.o
[ 36%] Linking CXX shared module _parser.so
[ 36%] Built target _parser
Scanning dependencies of target gen_logger_loggerPYTHON_wrap
[ 36%] Swig source
[ 36%] Built target gen_logger_loggerPYTHON_wrap
Scanning dependencies of target _logger
[ 37%] Building CXX object src/bindings/python/CMakeFiles/_logger.dir/libcellml/loggerPYTHON_wrap.cxx.o
[ 37%] Linking CXX shared module _logger.so
[ 37%] Built target _logger
Scanning dependencies of target gen_model_modelPYTHON_wrap
[ 38%] Swig source
[ 38%] Built target gen_model_modelPYTHON_wrap
Scanning dependencies of target _model
[ 40%] Building CXX object src/bindings/python/CMakeFiles/_model.dir/libcellml/modelPYTHON_wrap.cxx.o
[ 41%] Linking CXX shared module _model.so
[ 41%] Built target _model
Scanning dependencies of target gen_orderedentity_orderedentityPYTHON_wrap
[ 41%] Swig source
[ 41%] Built target gen_orderedentity_orderedentityPYTHON_wrap
Scanning dependencies of target _orderedentity
[ 42%] Building CXX object src/bindings/python/CMakeFiles/_orderedentity.dir/libcellml/orderedentityPYTHON_wrap.cxx.o
[ 42%] Linking CXX shared module _orderedentity.so
[ 42%] Built target _orderedentity
Scanning dependencies of target gen_enumerations_enumerationsPYTHON_wrap
[ 43%] Swig source
[ 43%] Built target gen_enumerations_enumerationsPYTHON_wrap
Scanning dependencies of target _enumerations
[ 43%] Building CXX object src/bindings/python/CMakeFiles/_enumerations.dir/libcellml/enumerationsPYTHON_wrap.cxx.o
[ 44%] Linking CXX shared module _enumerations.so
[ 44%] Built target _enumerations
Scanning dependencies of target gen___init_____init__PYTHON_wrap
[ 44%] Swig source
[ 44%] Built target gen___init_____init__PYTHON_wrap
Scanning dependencies of target ___init__
[ 44%] Building CXX object src/bindings/python/CMakeFiles/___init__.dir/libcellml/__init__PYTHON_wrap.cxx.o
[ 45%] Linking CXX shared module ___init__.so
[ 45%] Built target ___init__
Scanning dependencies of target gen_importsource_importsourcePYTHON_wrap
[ 46%] Swig source
[ 46%] Built target gen_importsource_importsourcePYTHON_wrap
Scanning dependencies of target _importsource
[ 46%] Building CXX object src/bindings/python/CMakeFiles/_importsource.dir/libcellml/importsourcePYTHON_wrap.cxx.o
[ 47%] Linking CXX shared module _importsource.so
[ 47%] Built target _importsource
Scanning dependencies of target gen_importedentity_importedentityPYTHON_wrap
[ 48%] Swig source
[ 48%] Built target gen_importedentity_importedentityPYTHON_wrap
Scanning dependencies of target _importedentity
[ 49%] Building CXX object src/bindings/python/CMakeFiles/_importedentity.dir/libcellml/importedentityPYTHON_wrap.cxx.o
[ 50%] Linking CXX shared module _importedentity.so
[ 50%] Built target _importedentity
Scanning dependencies of target gen_componententity_componententityPYTHON_wrap
[ 51%] Swig source
[ 51%] Built target gen_componententity_componententityPYTHON_wrap
Scanning dependencies of target _componententity
[ 52%] Building CXX object src/bindings/python/CMakeFiles/_componententity.dir/libcellml/componententityPYTHON_wrap.cxx.o
[ 52%] Linking CXX shared module _componententity.so
[ 52%] Built target _componententity
Scanning dependencies of target gen_error_errorPYTHON_wrap
[ 52%] Swig source
[ 52%] Built target gen_error_errorPYTHON_wrap
Scanning dependencies of target _error
[ 53%] Building CXX object src/bindings/python/CMakeFiles/_error.dir/libcellml/errorPYTHON_wrap.cxx.o
[ 53%] Linking CXX shared module _error.so
[ 53%] Built target _error
Scanning dependencies of target gen_namedentity_namedentityPYTHON_wrap
[ 54%] Swig source
[ 54%] Built target gen_namedentity_namedentityPYTHON_wrap
Scanning dependencies of target _namedentity
[ 54%] Building CXX object src/bindings/python/CMakeFiles/_namedentity.dir/libcellml/namedentityPYTHON_wrap.cxx.o
[ 55%] Linking CXX shared module _namedentity.so
[ 55%] Built target _namedentity
Scanning dependencies of target gen_component_componentPYTHON_wrap
[ 56%] Swig source
[ 56%] Built target gen_component_componentPYTHON_wrap
Scanning dependencies of target _component
[ 56%] Building CXX object src/bindings/python/CMakeFiles/_component.dir/libcellml/componentPYTHON_wrap.cxx.o
[ 57%] Linking CXX shared module _component.so
[ 57%] Built target _component
Scanning dependencies of target gen_entity_entityPYTHON_wrap
[ 57%] Swig source
[ 57%] Built target gen_entity_entityPYTHON_wrap
Scanning dependencies of target _entity
[ 58%] Building CXX object src/bindings/python/CMakeFiles/_entity.dir/libcellml/entityPYTHON_wrap.cxx.o
[ 60%] Linking CXX shared module _entity.so
[ 60%] Built target _entity
Scanning dependencies of target gtest
[ 61%] Building CXX object tests/gtest/CMakeFiles/gtest.dir/src/gtest-all.cc.o
[ 62%] Linking CXX shared library libgtest.dylib
[ 62%] Built target gtest
Scanning dependencies of target gtest_main
[ 62%] Building CXX object tests/gtest/CMakeFiles/gtest_main.dir/src/gtest_main.cc.o
[ 63%] Linking CXX shared library libgtest_main.dylib
[ 63%] Built target gtest_main
Scanning dependencies of target test_model
[ 64%] Building CXX object tests/CMakeFiles/test_model.dir/model/model.cpp.o
[ 64%] Building CXX object tests/CMakeFiles/test_model.dir/model/component_import.cpp.o
[ 65%] Building CXX object tests/CMakeFiles/test_model.dir/model/units_import.cpp.o
[ 66%] Building CXX object tests/CMakeFiles/test_model.dir/test_utils.cpp.o
[ 66%] Linking CXX executable test_model
[ 66%] Built target test_model
Scanning dependencies of target test_when
[ 66%] Building CXX object tests/CMakeFiles/test_when.dir/when/when.cpp.o
[ 67%] Building CXX object tests/CMakeFiles/test_when.dir/test_utils.cpp.o
[ 68%] Linking CXX executable test_when
[ 68%] Built target test_when
Scanning dependencies of target test_version
[ 68%] Building CXX object tests/CMakeFiles/test_version.dir/version/version.cpp.o
[ 69%] Building CXX object tests/CMakeFiles/test_version.dir/test_utils.cpp.o
[ 70%] Linking CXX executable test_version
[ 70%] Built target test_version
Scanning dependencies of target test_reset
[ 70%] Building CXX object tests/CMakeFiles/test_reset.dir/reset/reset.cpp.o
[ 71%] Building CXX object tests/CMakeFiles/test_reset.dir/test_utils.cpp.o
[ 72%] Linking CXX executable test_reset
[ 72%] Built target test_reset
Scanning dependencies of target test_units
[ 72%] Building CXX object tests/CMakeFiles/test_units.dir/units/units.cpp.o
[ 73%] Building CXX object tests/CMakeFiles/test_units.dir/test_utils.cpp.o
[ 74%] Linking CXX executable test_units
[ 74%] Built target test_units
Scanning dependencies of target test_generator
[ 75%] Building CXX object tests/CMakeFiles/test_generator.dir/generator/generator.cpp.o
[ 76%] Building CXX object tests/CMakeFiles/test_generator.dir/test_utils.cpp.o
[ 76%] Linking CXX executable test_generator
Undefined symbols for architecture x86_64:
  "std::__1::basic_string<char, std::__1::char_traits<char>, std::__1::allocator<char> > libcellml::Generator::generateCode<libcellml::CXX>(std::__1::shared_ptr<libcellml::Model>)", referenced from:
      Generator_generateSimpleModel_Test::TestBody() in generator.cpp.o
      Generator_generateComplexModel_Test::TestBody() in generator.cpp.o
      Generator_generateComplexModelToFile_Test::TestBody() in generator.cpp.o
      Generator_unknownNode_Test::TestBody() in generator.cpp.o
      Generator_divisionAndPower_Test::TestBody() in generator.cpp.o
ld: symbol(s) not found for architecture x86_64
clang: error: linker command failed with exit code 1 (use -v to see invocation)
make[2]: *** [tests/test_generator] Error 1
make[1]: *** [tests/CMakeFiles/test_generator.dir/all] Error 2
make: *** [all] Error 2
program finished with exit code 2
elapsedTime=50.928380